Reaction Details
TargetAdenosine receptor A1
LigandBDBM50095790
Substrate/Competitorn/a
Meas. Tech.ChEMBL_27568 (CHEMBL637242)
Ki 20±n/a nM
Citation Harada, HAsano, OHoshino, YYoshikawa, SMatsukura, MKabasawa, YNiijima, JKotake, YWatanabe, NKawata, TInoue, THorizoe, TYasuda, NMinami, HNagata, KMurakami, MNagaoka, JKobayashi, STanaka, IAbe, S 2-Alkynyl-8-aryl-9-methyladenines as novel adenosine receptor antagonists: their synthesis and structure-activity relationships toward hepatic glucose production induced via agonism of the A(2B) receptor. J Med Chem44:170-9 (2001) Adenosine receptor A1
Name:Adenosine receptor A1
Type:G Protein-Coupled Receptor (GPCR)
Mol. Mass.:36520.92
Organism:Homo sapiens (Human)
Description:P30542
Residue:326
BDBM50095790
NameBDBM50095790
Synonyms:1-[6-Amino-8-(3-fluoro-phenyl)-9-methyl-9H-purin-2-ylethynyl]-cyclopentanol | CHEMBL297685
TypeSmall organic molecule
Emp. Form.C19H18FN5O
Mol. Mass.351.3775
SMILESCn1c(nc2c(N)nc(nc12)C#CC1(O)CCCC1)-c1cccc(F)c1