Reaction Details
TargetAMP deaminase 3
LigandBDBM50096159
Substrate/Competitorn/a
Meas. Tech.ChEMBL_31886 (CHEMBL645676)
Ki 5000±n/a nM
Citation Kasibhatla, SRBookser, BCXiao, WErion, MD AMP deaminase inhibitors. 5. Design, synthesis, and SAR of a highly potent inhibitor series. J Med Chem44:613-8 (2001) AMP deaminase 3
Name:AMP deaminase 3
Type:Protein
Mol. Mass.:88818.80
Organism:Homo sapiens (Human)
Description:n/a
Residue:767
BDBM50096159
NameBDBM50096159
Synonyms:4-[2-(8-Hydroxy-7,8-dihydro-6H-imidazo[4,5-d][1,3]diazepin-3-yl)-ethyl]-5,6,7,8-tetrahydro-naphthalene-2-carboxylic acid benzyl ester | CHEMBL157723
TypeSmall organic molecule
Emp. Form.C26H28N4O3
Mol. Mass.444.5255
SMILESOC1CNC=Nc2c1ncn2CCc1cc(cc2CCCCc12)C(=O)OCc1ccccc1