Reaction Details
TargetAMP deaminase 3
LigandBDBM50096174
Substrate/Competitorn/a
Meas. Tech.ChEMBL_31886 (CHEMBL645676)
Ki 1000±n/a nM
Citation Kasibhatla, SRBookser, BCXiao, WErion, MD AMP deaminase inhibitors. 5. Design, synthesis, and SAR of a highly potent inhibitor series. J Med Chem44:613-8 (2001) AMP deaminase 3
Name:AMP deaminase 3
Type:Protein
Mol. Mass.:88818.80
Organism:Homo sapiens (Human)
Description:n/a
Residue:767
BDBM50096174
NameBDBM50096174
Synonyms:1-Bromo-4-[2-(8-hydroxy-7,8-dihydro-6H-imidazo[4,5-d][1,3]diazepin-3-yl)-ethyl]-5,6,7,8-tetrahydro-naphthalene-2-carboxylic acid ethyl ester | CHEMBL157669
TypeSmall organic molecule
Emp. Form.C21H25BrN4O3
Mol. Mass.461.352
SMILESCCOC(=O)c1cc(CCn2cnc3C(O)CNC=Nc23)c2CCCCc2c1Br