Reaction Details
TargetCathepsin K
LigandBDBM19797
Substrate/Competitorn/a
Meas. Tech.ChEBML_48320
Ki 60±n/a nM
Citation Fenwick, AEGarnier, BGribble, ADIfe, RJRawlings, ADWitherington, J Solid-phase synthesis of cyclic alkoxyketones, inhibitors of the cysteine protease cathepsin K. Bioorg Med Chem Lett11:195-8 (2001) Cathepsin K
Name:Cathepsin K
Type:Enzyme
Mol. Mass.:36975.68
Organism:Homo sapiens (Human)
Description:P43235
Residue:329
BDBM19797
NameBDBM19797
Synonyms:CHEMBL301683 benzyl N-[(1S)-1-{[(2S)-4-methoxy-3-oxobutan-2-yl]carbamoyl}-3-methylbutyl]carbamate
TypeSmall organic molecule
Emp. Form.C19H28N2O5
Mol. Mass.364.436
SMILESCOCC(=O)[C@H](C)NC(=O)[C@H](CC(C)C)NC(=O)OCc1ccccc1