Reaction Details
TargetCathepsin K
LigandBDBM50096389
Substrate/Competitorn/a
Meas. Tech.ChEBML_48320
Ki 190±n/a nM
Citation Fenwick, AEGarnier, BGribble, ADIfe, RJRawlings, ADWitherington, J Solid-phase synthesis of cyclic alkoxyketones, inhibitors of the cysteine protease cathepsin K. Bioorg Med Chem Lett11:195-8 (2001) Cathepsin K
Name:Cathepsin K
Type:Enzyme
Mol. Mass.:36975.68
Organism:Homo sapiens (Human)
Description:P43235
Residue:329
BDBM50096389
NameBDBM50096389
Synonyms:Benzo[b]thiophene-2-carboxylic acid [(S)-1-(4-oxo-tetrahydro-furan-3-ylcarbamoyl)-butyl]-amide | CHEMBL62014
TypeSmall organic molecule
Emp. Form.C18H20N2O4S
Mol. Mass.360.427
SMILESCCC[C@H](NC(=O)c1cc2ccccc2s1)C(=O)NC1COCC1=O