Reaction Details
TargetCathepsin K
LigandBDBM50096383
Substrate/Competitorn/a
Meas. Tech.ChEBML_216707
Ki 11±n/a nM
Citation Fenwick, AEGribble, ADIfe, RJStevens, NWitherington, J Diastereoselective synthesis, activity and chiral stability of cyclic alkoxyketone inhibitors of cathepsin K. Bioorg Med Chem Lett11:199-202 (2001) Cathepsin K
Name:Cathepsin K
Type:Enzyme
Mol. Mass.:36975.68
Organism:Homo sapiens (Human)
Description:P43235
Residue:329
BDBM50096383
NameBDBM50096383
Synonyms:Benzo[b]thiophene-2-carboxylic acid [(S)-3-methyl-1-(4-oxo-tetrahydro-furan-3-ylcarbamoyl)-butyl]-amide | CHEMBL292106
TypeSmall organic molecule
Emp. Form.C19H22N2O4S
Mol. Mass.374.454
SMILESCC(C)C[C@H](NC(=O)c1cc2ccccc2s1)C(=O)NC1COCC1=O