Reaction Details
TargetCoagulation factor X
LigandBDBM13862
Substrate/Competitorn/a
Meas. Tech.ChEMBL_197821 (CHEMBL802350)
Ki 11±n/a nM
Citation Heinelt, UHerok, SMatter, HWildgoose, P Solid-phase optimisation of achiral amidinobenzyl indoles as potent and selective factor Xa inhibitors. Bioorg Med Chem Lett11:227-30 (2001) Coagulation factor X
Name:Coagulation factor X
Type:Enzyme
Mol. Mass.:54726.60
Organism:Homo sapiens (Human)
Description:n/a
Residue:488
BDBM13862
NameBDBM13862
Synonyms:1-[(3-carbamimidoylphenyl)methyl]-N-[(3,5-dimethylphenyl)methyl]-4-hydroxy-1H-indole-2-carboxamide CHEMBL307196
TypeSmall organic molecule
Emp. Form.C26H26N4O2
Mol. Mass.426.5102
SMILESCc1cc(C)cc(CNC(=O)c2cc3c(O)cccc3n2Cc2cccc(c2)C(N)=N)c1