Reaction Details
TargetProthrombin
LigandBDBM13897
Substrate/Competitorn/a
Meas. Tech.ChEBML_208507
Ki 12000±n/a nM
Citation Heinelt, UHerok, SMatter, HWildgoose, P Solid-phase optimisation of achiral amidinobenzyl indoles as potent and selective factor Xa inhibitors. Bioorg Med Chem Lett11:227-30 (2001) Prothrombin
Name:Prothrombin
Type:Protein
Mol. Mass.:70029.57
Organism:Homo sapiens (Human)
Description:P00734
Residue:622
BDBM13897
NameBDBM13897
Synonyms:2,2,2-trifluoroacetate; 4-[({1-[(3-carbamimidoylphenyl)methyl]-5-hydroxy-1H-indol-2-yl}formamido)methyl]-N,N,N-trimethylanilinium CHEMBL306300
TypeSmall organic molecule
Emp. Form.C27H30N5O2
Mol. Mass.456.5589
SMILESC[N+](C)(C)c1ccc(CNC(=O)c2cc3cc(O)ccc3n2Cc2cccc(c2)C(N)=N)cc1