Reaction Details
Target72 kDa type IV collagenase
LigandBDBM50096645
Substrate/Competitorn/a
Meas. Tech.ChEBML_104377
IC50 49±n/a nM
Citation Chollet, AMLe Diguarher, TMurray, LBertrand, MTucker, GCSabatini, MPierré, AAtassi, GBonnet, JCasara, P General synthesis of alpha-substituted 3-bisaryloxy propionic acid derivatives as specific MMP inhibitors. Bioorg Med Chem Lett11:295-9 (2001) 72 kDa type IV collagenase
Name:72 kDa type IV collagenase
Type:Enzyme
Mol. Mass.:73870.36
Organism:Homo sapiens (Human)
Description: P08253
Residue:660
BDBM50096645
NameBDBM50096645
Synonyms:3-(4'-Cyano-biphenyl-4-yloxy)-N-hydroxy-propionamide 3-[(4'-cyanobiphenyl-4-yl)oxy]-N-hydroxypropanamide | CHEMBL38851
TypeSmall organic molecule
Emp. Form.C16H14N2O3
Mol. Mass.282.294
SMILESONC(=O)CCOc1ccc(cc1)-c1ccc(cc1)C#N