Reaction Details
Target72 kDa type IV collagenase
LigandBDBM50096651
Substrate/Competitorn/a
Meas. Tech.ChEBML_104377
IC50 0.400000±n/a nM
Citation Chollet, AMLe Diguarher, TMurray, LBertrand, MTucker, GCSabatini, MPierré, AAtassi, GBonnet, JCasara, P General synthesis of alpha-substituted 3-bisaryloxy propionic acid derivatives as specific MMP inhibitors. Bioorg Med Chem Lett11:295-9 (2001) 72 kDa type IV collagenase
Name:72 kDa type IV collagenase
Type:Enzyme
Mol. Mass.:73870.36
Organism:Homo sapiens (Human)
Description: P08253
Residue:660
BDBM50096651
NameBDBM50096651
Synonyms:2-(4'-Cyano-biphenyl-4-yloxymethyl)-N-hydroxy-4-(4-oxo-4H-benzo[d][1,2,3]triazin-3-yl)-butyramide | CHEMBL317508
TypeSmall organic molecule
Emp. Form.C25H21N5O4
Mol. Mass.455.4653
SMILESONC(=O)C(CCn1nnc2ccccc2c1=O)COc1ccc(cc1)-c1ccc(cc1)C#N