Reaction Details
TargetInterstitial collagenase
LigandBDBM50096651
Substrate/Competitorn/a
Meas. Tech.ChEBML_105977
IC50 116±n/a nM
Citation Chollet, AMLe Diguarher, TMurray, LBertrand, MTucker, GCSabatini, MPierré, AAtassi, GBonnet, JCasara, P General synthesis of alpha-substituted 3-bisaryloxy propionic acid derivatives as specific MMP inhibitors. Bioorg Med Chem Lett11:295-9 (2001) Interstitial collagenase
Name:Interstitial collagenase
Type:Enzyme
Mol. Mass.:54010.26
Organism:Homo sapiens (Human)
Description: P03956
Residue:469
BDBM50096651
NameBDBM50096651
Synonyms:2-(4'-Cyano-biphenyl-4-yloxymethyl)-N-hydroxy-4-(4-oxo-4H-benzo[d][1,2,3]triazin-3-yl)-butyramide | CHEMBL317508
TypeSmall organic molecule
Emp. Form.C25H21N5O4
Mol. Mass.455.4653
SMILESONC(=O)C(CCn1nnc2ccccc2c1=O)COc1ccc(cc1)-c1ccc(cc1)C#N