Reaction Details
TargetStromelysin-1
LigandBDBM50096646
Substrate/Competitorn/a
Meas. Tech.ChEBML_104720
IC50 3.2±n/a nM
Citation Chollet, AMLe Diguarher, TMurray, LBertrand, MTucker, GCSabatini, MPierré, AAtassi, GBonnet, JCasara, P General synthesis of alpha-substituted 3-bisaryloxy propionic acid derivatives as specific MMP inhibitors. Bioorg Med Chem Lett11:295-9 (2001) Stromelysin-1
Name:Stromelysin-1
Type:Enzyme
Mol. Mass.:53973.13
Organism:Homo sapiens (Human)
Description: P08254
Residue:477
BDBM50096646
NameBDBM50096646
Synonyms:2-(4'-Chloro-biphenyl-4-yloxymethyl)-N-hydroxy-4-(4-oxo-4H-benzo[d][1,2,3]triazin-3-yl)-butyramide | CHEMBL317132
TypeSmall organic molecule
Emp. Form.C24H21ClN4O4
Mol. Mass.464.901
SMILESONC(=O)C(CCn1nnc2ccccc2c1=O)COc1ccc(cc1)-c1ccc(Cl)cc1