Reaction Details
Target72 kDa type IV collagenase
LigandBDBM50096650
Substrate/Competitorn/a
Meas. Tech.ChEBML_104377
IC50 24±n/a nM
Citation Chollet, AMLe Diguarher, TMurray, LBertrand, MTucker, GCSabatini, MPierré, AAtassi, GBonnet, JCasara, P General synthesis of alpha-substituted 3-bisaryloxy propionic acid derivatives as specific MMP inhibitors. Bioorg Med Chem Lett11:295-9 (2001) 72 kDa type IV collagenase
Name:72 kDa type IV collagenase
Type:Enzyme
Mol. Mass.:73870.36
Organism:Homo sapiens (Human)
Description: P08253
Residue:660
BDBM50096650
NameBDBM50096650
Synonyms:2-(Biphenyl-4-yloxymethyl)-4-(2,4-dioxo-1,4-dihydro-2H-quinazolin-3-yl)-N-hydroxy-butyramide | CHEMBL100805
TypeSmall organic molecule
Emp. Form.C25H23N3O5
Mol. Mass.445.4672
SMILESONC(=O)C(CCn1c(=O)[nH]c2ccccc2c1=O)COc1ccc(cc1)-c1ccccc1