Reaction Details
TargetKappa-type opioid receptor
LigandBDBM50096714
Substrate/Competitorn/a
Meas. Tech.ChEBML_145963
Ki>10000±n/a nM
Citation Lu, YWeltrowska, GLemieux, CChung, NNSchiller, PW Stereospecific synthesis of (2S)-2-methyl-3-(2',6'-dimethyl-4'-hydroxyphenyl)-propionic acid (Mdp) and its incorporation into an opioid peptide. Bioorg Med Chem Lett11:323-5 (2001) Kappa-type opioid receptor
Name:Kappa-type opioid receptor
Type:G Protein-Coupled Receptor (GPCR)
Mol. Mass.:42648.76
Organism:Homo sapiens (Human)
Description:P41145
Residue:380
BDBM50096714
NameBDBM50096714
Synonyms:2-[2-(2-{2-[2-Amino-3-(4-hydroxy-2,6-dimethyl-phenyl)-propionylamino]-propionylamino}-acetylamino)-3-phenyl-propionylamino]-4-methyl-pentanoic acid amide | CHEMBL326235
TypeSmall organic molecule
Emp. Form.C31H44N6O6
Mol. Mass.596.7177
SMILESCC(C)C[C@H](NC(=O)[C@H](Cc1ccccc1)NC(=O)CNC(=O)[C@H](C)NC(=O)[C@@H](N)Cc1c(C)cc(O)cc1C)C(N)=O