Reaction Details
TargetCorticotropin-releasing factor receptor 1
LigandBDBM50096721
Substrate/Competitorn/a
Meas. Tech.ChEBML_51283
Ki 3±n/a nM
Citation Tian, XHsin, LWWebster, ELContoreggi, CChrousos, GPGold, PWHabib, KAyala, AEckelman, WCJacobson, AERice, KC The development of a potential single photon emission computed tomography (SPECT) imaging agent for the corticotropin-releasing hormone receptor type. Bioorg Med Chem Lett11:331-3 (2001) Corticotropin-releasing factor receptor 1
Name:Corticotropin-releasing factor receptor 1
Type:G Protein-Coupled Receptor (GPCR)
Mol. Mass.:47870.75
Organism:Rattus norvegicus (rat)
Description:Receptor binding assays were performed using rat cortex homogenate.
Residue:415
BDBM50096721
NameBDBM50096721
Synonyms:5-Chloro-N-cyclopropylmethyl-N'-(2,6-dichloro-4-tributylstannanyl-phenyl)-2-methyl-N-propyl-pyrimidine-4,6-diamine | CHEMBL115836
TypeSmall organic molecule
Emp. Form.C30H47Cl3N4Sn
Mol. Mass.688.79
SMILESCCCC[Sn](CCCC)(CCCC)c1cc(Cl)c(Nc2nc(C)nc(N(CCC)CC3CC3)c2Cl)c(Cl)c1