Reaction Details
Target1,3-beta-glucan synthase
LigandBDBM50096793
Substrate/Competitorn/a
Meas. Tech.ChEBML_52575
IC50 6±n/a nM
Citation Masubuchi, KOkada, TKohchi, MSakaitani, MMizuguchi, EShirai, HAoki, MWatanabe, TKondoh, OYamazaki, TSatoh, YKobayashi, KInoue, THorii, IShimma, N Synthesis and antifungal activities of novel 1,3-beta-D-glucan synthase inhibitors. Part 1. Bioorg Med Chem Lett11:395-8 (2001) 1,3-beta-glucan synthase
Name:1,3-beta-glucan synthase
Type:Enzyme
Mol. Mass.:218006.59
Organism:Candida albicans (Yeast)
Description:O13428
Residue:1897
BDBM50096793
NameBDBM50096793
Synonyms:CHEMBL2370666 | macrocyclic lipopeptidolactone derivative
TypeSmall organic molecule
Emp. Form.C70H116N14O22
Mol. Mass.1505.7506
SMILES[H][C@@]12C[C@@H](O)CN1C(=O)[C@@H](NC(=O)[C@H](Cc1ccc(O)cc1)NC(=O)[C@@H](C)NC(=O)[C@@]([H])(NC(=O)C[C@@H](CCCCCCCCCCCCC)OC(=O)[C@H](CCN)NC(=O)[C@@]([H])(NC(=O)CNC(=O)[C@@]([H])(NC(=O)[C@]1([H])[C@@H](O)CCN1C(=O)[C@@]([H])(NC(=O)[C@@]([H])(NC2=O)[C@@H](C)O)[C@@H](C)O)[C@H](O)CCN)[C@@H](C)O)[C@@H](C)O)C(C)C