Reaction Details
TargetSomatostatin receptor type 2
LigandBDBM50096831
Substrate/Competitorn/a
Meas. Tech.ChEBML_200365
Ki 9±n/a nM
Citation Zhou, CGuo, LMorriello, GPasternak, APan, YRohrer, SPBirzin, ETHuskey, SEJacks, TSchleim, KDCheng, KSchaeffer, JMPatchett, AAYang, L Nipecotic and iso-nipecotic amides as potent and selective somatostatin subtype-2 receptor agonists. Bioorg Med Chem Lett11:415-7 (2001) Somatostatin receptor type 2
Name:Somatostatin receptor type 2
Type:Enzyme
Mol. Mass.:41344.94
Organism:Homo sapiens (Human)
Description:P30874
Residue:369
BDBM50096831
NameBDBM50096831
Synonyms:(S)-6-Amino-2-((S)-3-(1H-indol-3-yl)-2-{[1-(3-methoxy-phenylcarbamoyl)-piperidine-3-carbonyl]-amino}-butyrylamino)-hexanoic acid tert-butyl ester | CHEMBL134353
TypeSmall organic molecule
Emp. Form.C36H50N6O6
Mol. Mass.662.8188
SMILESCOc1cccc(NC(=O)N2CCCC(C2)C(=O)NC([C@@H](C)c2c[nH]c3ccccc23)C(=O)N[C@@H](CCCCN)C(=O)OC(C)(C)C)c1