Reaction Details
TargetSomatostatin receptor type 2
LigandBDBM50096832
Substrate/Competitorn/a
Meas. Tech.ChEBML_200365
Ki 10±n/a nM
Citation Zhou, CGuo, LMorriello, GPasternak, APan, YRohrer, SPBirzin, ETHuskey, SEJacks, TSchleim, KDCheng, KSchaeffer, JMPatchett, AAYang, L Nipecotic and iso-nipecotic amides as potent and selective somatostatin subtype-2 receptor agonists. Bioorg Med Chem Lett11:415-7 (2001) Somatostatin receptor type 2
Name:Somatostatin receptor type 2
Type:Enzyme
Mol. Mass.:41344.94
Organism:Homo sapiens (Human)
Description:P30874
Residue:369
BDBM50096832
NameBDBM50096832
Synonyms:(S)-6-Amino-2-[(S)-2-{[1-(2-benzo[1,3]dioxol-5-yl-acetyl)-piperidine-3-carbonyl]-amino}-3-(1H-indol-3-yl)-butyrylamino]-hexanoic acid tert-butyl ester | CHEMBL337846
TypeSmall organic molecule
Emp. Form.C37H49N5O7
Mol. Mass.675.8143
SMILESC[C@H](C(NC(=O)C1CCCN(C1)C(=O)Cc1ccc2OCOc2c1)C(=O)N[C@@H](CCCCN)C(=O)OC(C)(C)C)c1c[nH]c2ccccc12