Reaction Details
TargetCannabinoid receptor 1
LigandBDBM50096882
Substrate/Competitorn/a
Meas. Tech.ChEBML_40026
Ki 1720±n/a nM
Citation Bezuglov, VBobrov, MGretskaya, NGonchar, AZinchenko, GMelck, DBisogno, TDi Marzo, VKuklev, DRossi, JCVidal, JPDurand, T Synthesis and biological evaluation of novel amides of polyunsaturated fatty acids with dopamine. Bioorg Med Chem Lett11:447-9 (2001) Cannabinoid receptor 1
Name:Cannabinoid receptor 1
Type:G Protein-Coupled Receptor (GPCR)
Mol. Mass.:52856.55
Organism:Rattus norvegicus (rat)
Description:P20272
Residue:473
BDBM50096882
NameBDBM50096882
Synonyms:(5Z,9Z,12Z)-Octadeca-5,9,12-trienoic acid [2-(3,4-dihydroxy-phenyl)-ethyl]-amide | CHEMBL422637
TypeSmall organic molecule
Emp. Form.C26H39NO3
Mol. Mass.413.5928
SMILESCCCCC\C=C/C\C=C/CC\C=C/CCCC(=O)NCCc1ccc(O)c(O)c1