Reaction Details
TargetReverse transcriptase/RNaseH
LigandBDBM50097037
Substrate/Competitorn/a
Meas. Tech.ChEMBL_140625 (CHEMBL752870)
IC50>100000±n/a nM
Citation Venkatachalam, TKSudbeck, EAMao, CUckun, FM Anti-HIV activity of aromatic and heterocyclic thiazolyl thiourea compounds. Bioorg Med Chem Lett11:523-8 (2001) Reverse transcriptase/RNaseH
Name:Reverse transcriptase/RNaseH
Type:PROTEIN
Mol. Mass.:65229.15
Organism:Human immunodeficiency virus 1
Description:ChEMBL_1473730
Residue:566
BDBM50097037
NameBDBM50097037
Synonyms:1-Thiazol-2-yl-3-(2-p-tolyl-ethyl)-thiourea | CHEMBL149100
TypeSmall organic molecule
Emp. Form.C13H15N3S2
Mol. Mass.277.408
SMILESCc1ccc(CCNC(=S)Nc2nccs2)cc1