Reaction Details
TargetReverse transcriptase/RNaseH
LigandBDBM50097040
Substrate/Competitorn/a
Meas. Tech.ChEMBL_140625 (CHEMBL752870)
IC50>100000±n/a nM
Citation Venkatachalam, TKSudbeck, EAMao, CUckun, FM Anti-HIV activity of aromatic and heterocyclic thiazolyl thiourea compounds. Bioorg Med Chem Lett11:523-8 (2001) Reverse transcriptase/RNaseH
Name:Reverse transcriptase/RNaseH
Type:PROTEIN
Mol. Mass.:65229.15
Organism:Human immunodeficiency virus 1
Description:ChEMBL_1473730
Residue:566
BDBM50097040
NameBDBM50097040
Synonyms:1-(2-Phenoxy-ethyl)-3-thiazol-2-yl-thiourea | CHEMBL345996
TypeSmall organic molecule
Emp. Form.C12H13N3OS2
Mol. Mass.279.381
SMILESS=C(NCCOc1ccccc1)Nc1nccs1