Reaction Details
TargetBifunctional glutamate/proline--tRNA ligase
LigandBDBM50097082
Substrate/Competitorn/a
Meas. Tech.ChEBML_223472
IC50>100000±n/a nM
Citation Yu, XYHill, JMYu, GYang, YKluge, AFKeith, DFinn, JGallant, PSilverman, JLim, A A series of quinoline analogues as potent inhibitors of C. albicans prolyl tRNA synthetase. Bioorg Med Chem Lett11:541-4 (2001) Bifunctional glutamate/proline--tRNA ligase
Name:Bifunctional glutamate/proline--tRNA ligase
Type:PROTEIN
Mol. Mass.:170602.50
Organism:Homo sapiens (Human)
Description:ChEMBL_223474
Residue:1512
BDBM50097082
NameBDBM50097082
Synonyms:2-(4-Bromo-phenyl)-6-iodo-quinoline-4-carboxylic acid | CHEMBL357572
TypeSmall organic molecule
Emp. Form.C16H9BrINO2
Mol. Mass.454.057
SMILESOC(=O)c1cc(nc2ccc(I)cc12)-c1ccc(Br)cc1