Reaction Details
TargetProline--tRNA ligase, cytoplasmic
LigandBDBM50097096
Substrate/Competitorn/a
Meas. Tech.ChEBML_223470
IC50 5±n/a nM
Citation Yu, XYHill, JMYu, GYang, YKluge, AFKeith, DFinn, JGallant, PSilverman, JLim, A A series of quinoline analogues as potent inhibitors of C. albicans prolyl tRNA synthetase. Bioorg Med Chem Lett11:541-4 (2001) Proline--tRNA ligase, cytoplasmic
Name:Proline--tRNA ligase, cytoplasmic
Type:PROTEIN
Mol. Mass.:66202.25
Organism:Candida albicans
Description:ChEMBL_223470
Residue:575
BDBM50097096
NameBDBM50097096
Synonyms:2-(4-Bromo-phenyl)-6-chloro-8-methyl-quinoline-4-carboxylic acid | CHEMBL357355
TypeSmall organic molecule
Emp. Form.C17H11BrClNO2
Mol. Mass.376.632
SMILESCc1cc(Cl)cc2c(cc(nc12)-c1ccc(Br)cc1)C(O)=O