Reaction Details
TargetBifunctional glutamate/proline--tRNA ligase
LigandBDBM50097095
Substrate/Competitorn/a
Meas. Tech.ChEBML_223472
IC50>100000±n/a nM
Citation Yu, XYHill, JMYu, GYang, YKluge, AFKeith, DFinn, JGallant, PSilverman, JLim, A A series of quinoline analogues as potent inhibitors of C. albicans prolyl tRNA synthetase. Bioorg Med Chem Lett11:541-4 (2001) Bifunctional glutamate/proline--tRNA ligase
Name:Bifunctional glutamate/proline--tRNA ligase
Type:PROTEIN
Mol. Mass.:170602.50
Organism:Homo sapiens (Human)
Description:ChEMBL_223474
Residue:1512
BDBM50097095
NameBDBM50097095
Synonyms:2-(4-Bromo-phenyl)-6-chloro-8-methyl-quinoline-4-carboxylic acid 3,4-dichloro-benzyl ester | CHEMBL345331
TypeSmall organic molecule
Emp. Form.C24H15BrCl3NO2
Mol. Mass.535.644
SMILESCc1cc(Cl)cc2c(cc(nc12)-c1ccc(Br)cc1)C(=O)OCc1ccc(Cl)c(Cl)c1