Reaction Details
TargetStromelysin-1
LigandBDBM50097259
Substrate/Competitorn/a
Meas. Tech.ChEBML_104580
IC50 120±n/a nM
Citation Fray, MJDickinson, RP Discovery of potent and selective succinyl hydroxamate inhibitors of matrix metalloprotease-3 (stromelysin-1). Bioorg Med Chem Lett11:571-4 (2001) Stromelysin-1
Name:Stromelysin-1
Type:Enzyme
Mol. Mass.:53973.13
Organism:Homo sapiens (Human)
Description: P08254
Residue:477
BDBM50097259
NameBDBM50097259
Synonyms:(R)-2-(3-Cyclohexyl-propyl)-N*1*-[(S)-2,2-dimethyl-1-((R)-1-phenyl-ethylcarbamoyl)-propyl]-N*4*-hydroxy-succinamide (R)-2-(3-cyclohexylpropyl)-N1-((S)-3,3-dimethyl-1-oxo-1-((R)-1-phenylethylamino)butan-2-yl)-N4-hydroxysuccinamide | CHEMBL154040
TypeSmall organic molecule
Emp. Form.C27H43N3O4
Mol. Mass.473.648
SMILESC[C@@H](NC(=O)[C@@H](NC(=O)[C@H](CCCC1CCCCC1)CC(=O)NO)C(C)(C)C)c1ccccc1