Reaction Details
Target72 kDa type IV collagenase
LigandBDBM50097264
Substrate/Competitorn/a
Meas. Tech.ChEBML_106807
IC50 6800±n/a nM
Citation Fray, MJDickinson, RP Discovery of potent and selective succinyl hydroxamate inhibitors of matrix metalloprotease-3 (stromelysin-1). Bioorg Med Chem Lett11:571-4 (2001) 72 kDa type IV collagenase
Name:72 kDa type IV collagenase
Type:Enzyme
Mol. Mass.:73870.36
Organism:Homo sapiens (Human)
Description: P08253
Residue:660
BDBM50097264
NameBDBM50097264
Synonyms:(R)-N*1*-[(S)-2,2-dimethyl-1-((R)-1-phenyl-ethylcarbamoyl)-propyl]-2-[3-(2-ethyl-biphenyl-4-yl)-propyl]-N*4*-hydroxy-succinamide | CHEMBL154169
TypeSmall organic molecule
Emp. Form.C35H45N3O4
Mol. Mass.571.7495
SMILESCCc1cc(CCC[C@H](CC(=O)NO)C(=O)N[C@H](C(=O)N[C@H](C)c2ccccc2)C(C)(C)C)ccc1-c1ccccc1