Reaction Details
TargetStromelysin-1
LigandBDBM50097261
Substrate/Competitorn/a
Meas. Tech.ChEBML_104580
IC50 3.8±n/a nM
Citation Fray, MJDickinson, RP Discovery of potent and selective succinyl hydroxamate inhibitors of matrix metalloprotease-3 (stromelysin-1). Bioorg Med Chem Lett11:571-4 (2001) Stromelysin-1
Name:Stromelysin-1
Type:Enzyme
Mol. Mass.:53973.13
Organism:Homo sapiens (Human)
Description: P08254
Residue:477
BDBM50097261
NameBDBM50097261
Synonyms:(R)-2-(3-(9H-fluoren-2-yl)propyl)-N1-((S)-3,3-dimethyl-1-oxo-1-((R)-1-phenylethylamino)butan-2-yl)-N4-hydroxysuccinamide CHEMBL156830
TypeSmall organic molecule
Emp. Form.C34H41N3O4
Mol. Mass.555.707
SMILESC[C@@H](NC(=O)[C@@H](NC(=O)[C@H](CCCc1ccc-2c(Cc3ccccc-23)c1)CC(=O)NO)C(C)(C)C)c1ccccc1