Reaction Details
TargetStromelysin-1
LigandBDBM50097267
Substrate/Competitorn/a
Meas. Tech.ChEBML_104580
IC50 10±n/a nM
Citation Fray, MJDickinson, RP Discovery of potent and selective succinyl hydroxamate inhibitors of matrix metalloprotease-3 (stromelysin-1). Bioorg Med Chem Lett11:571-4 (2001) Stromelysin-1
Name:Stromelysin-1
Type:Enzyme
Mol. Mass.:53973.13
Organism:Homo sapiens (Human)
Description: P08254
Residue:477
BDBM50097267
NameBDBM50097267
Synonyms:(R)-N*1*-[(S)-1-(benzhydryl-carbamoyl)-2,2-dimethyl-propyl]-2-[3-(2-fluoro-biphenyl-4-yl)-propyl]-N*4*-hydroxy-succinamide | CHEMBL443818
TypeSmall organic molecule
Emp. Form.C38H42FN3O4
Mol. Mass.623.7562
SMILESCC(C)(C)[C@H](NC(=O)[C@H](CCCc1ccc(c(F)c1)-c1ccccc1)CC(=O)NO)C(=O)NC(c1ccccc1)c1ccccc1