Reaction Details
TargetStromelysin-1
LigandBDBM50097265
Substrate/Competitorn/a
Meas. Tech.ChEBML_104580
IC50 26±n/a nM
Citation Fray, MJDickinson, RP Discovery of potent and selective succinyl hydroxamate inhibitors of matrix metalloprotease-3 (stromelysin-1). Bioorg Med Chem Lett11:571-4 (2001) Stromelysin-1
Name:Stromelysin-1
Type:Enzyme
Mol. Mass.:53973.13
Organism:Homo sapiens (Human)
Description: P08254
Residue:477
BDBM50097265
NameBDBM50097265
Synonyms:(R)-N*1*-[(S)-2,2-dimethyl-1-((R)-1-phenyl-ethylcarbamoyl)-propyl]-2-[2-(4'-fluoro-biphenyl-4-yl)-ethyl]-N*4*-hydroxy-succinamide | CHEMBL348878
TypeSmall organic molecule
Emp. Form.C32H38FN3O4
Mol. Mass.547.6602
SMILESC[C@@H](NC(=O)[C@@H](NC(=O)[C@H](CCc1ccc(cc1)-c1ccc(F)cc1)CC(=O)NO)C(C)(C)C)c1ccccc1