Reaction Details
TargetStromelysin-1
LigandBDBM50097263
Substrate/Competitorn/a
Meas. Tech.ChEBML_104580
IC50 5.9±n/a nM
Citation Fray, MJDickinson, RP Discovery of potent and selective succinyl hydroxamate inhibitors of matrix metalloprotease-3 (stromelysin-1). Bioorg Med Chem Lett11:571-4 (2001) Stromelysin-1
Name:Stromelysin-1
Type:Enzyme
Mol. Mass.:53973.13
Organism:Homo sapiens (Human)
Description: P08254
Residue:477
BDBM50097263
NameBDBM50097263
Synonyms:(R)-N*1*-[(S)-2,2-Dimethyl-1-((R)-1-phenyl-ethylcarbamoyl)-propyl]-N*4*-hydroxy-2-[3-(2-methyl-biphenyl-4-yl)-propyl]-succinamide CHEMBL117225 UK-356618
TypeSmall organic molecule
Emp. Form.C34H43N3O4
Mol. Mass.557.7229
SMILESC[C@@H](NC(=O)[C@@H](NC(=O)[C@H](CCCc1ccc(c(C)c1)-c1ccccc1)CC(=O)NO)C(C)(C)C)c1ccccc1