Reaction Details
Target72 kDa type IV collagenase
LigandBDBM50097263
Substrate/Competitorn/a
Meas. Tech.ChEBML_106807
IC50 1790±n/a nM
Citation Fray, MJDickinson, RP Discovery of potent and selective succinyl hydroxamate inhibitors of matrix metalloprotease-3 (stromelysin-1). Bioorg Med Chem Lett11:571-4 (2001) 72 kDa type IV collagenase
Name:72 kDa type IV collagenase
Type:Enzyme
Mol. Mass.:73870.36
Organism:Homo sapiens (Human)
Description: P08253
Residue:660
BDBM50097263
NameBDBM50097263
Synonyms:(R)-N*1*-[(S)-2,2-Dimethyl-1-((R)-1-phenyl-ethylcarbamoyl)-propyl]-N*4*-hydroxy-2-[3-(2-methyl-biphenyl-4-yl)-propyl]-succinamide CHEMBL117225 UK-356618
TypeSmall organic molecule
Emp. Form.C34H43N3O4
Mol. Mass.557.7229
SMILESC[C@@H](NC(=O)[C@@H](NC(=O)[C@H](CCCc1ccc(c(C)c1)-c1ccccc1)CC(=O)NO)C(C)(C)C)c1ccccc1