Reaction Details
TargetTelomerase reverse transcriptase
LigandBDBM50097318
Substrate/Competitorn/a
Meas. Tech.ChEMBL_225406 (CHEMBL846604)
IC50 6700±n/a nM
Citation Sasaki, SEhara, TSakata, IFujino, YHarada, NKimura, JNakamura, HMaeda, M Development of novel telomerase inhibitors based on a bisindole unit. Bioorg Med Chem Lett11:583-5 (2001) Telomerase reverse transcriptase
Name:Telomerase reverse transcriptase
Type:PROTEIN
Mol. Mass.:127099.03
Organism:Homo sapiens (Human)
Description:ChEMBL_1447029
Residue:1132
BDBM50097318
NameBDBM50097318
Synonyms:CHEMBL155030 | Phosphoric acid 12-(2-{1-[2-(5-chloro-indol-1-yl)-ethyl]-1H-indol-3-yl}-acetylamino)-dodecyl ester phenyl ester; compound with triethyl-amine
TypeSmall organic molecule
Emp. Form.C38H47ClN3O5P
Mol. Mass.692.224
SMILESOP(=O)(OCCCCCCCCCCCCNC(=O)Cc1cn(CCn2ccc3cc(Cl)ccc23)c2ccccc12)Oc1ccccc1