Reaction Details
TargetTelomerase reverse transcriptase
LigandBDBM50097332
Substrate/Competitorn/a
Meas. Tech.ChEBML_225405
IC50 20000±n/a nM
Citation Sasaki, SEhara, TSakata, IFujino, YHarada, NKimura, JNakamura, HMaeda, M Development of novel telomerase inhibitors based on a bisindole unit. Bioorg Med Chem Lett11:583-5 (2001) Telomerase reverse transcriptase
Name:Telomerase reverse transcriptase
Type:PROTEIN
Mol. Mass.:127099.03
Organism:Homo sapiens (Human)
Description:ChEMBL_1447029
Residue:1132
BDBM50097332
NameBDBM50097332
Synonyms:12-(2-{1-[3-(3-Methyl-indol-1-yl)-propyl]-1H-indol-3-yl}-acetylamino)-dodecanoic acid | CHEMBL154475
TypeSmall organic molecule
Emp. Form.C34H45N3O3
Mol. Mass.543.7394
SMILESCc1cn(CCCn2cc(CC(=O)NCCCCCCCCCCCC(O)=O)c3ccccc23)c2ccccc12