Reaction Details
TargetNeuronal acetylcholine receptor subunit alpha-4/beta-2
LigandBDBM50097597
Substrate/Competitorn/a
Meas. Tech.ChEMBL_143716 (CHEMBL753467)
Ki 0.055000±n/a nM
Citation Lin, NHLi, YHe, YHolladay, MWKuntzweiler, TAnderson, DJCampbell, JEArneric, SP Synthesis and structure-activity relationships of 5-substituted pyridine analogues of 3. Bioorg Med Chem Lett11:631-3 (2001) Neuronal acetylcholine receptor subunit alpha-4/beta-2
Name:Neuronal acetylcholine receptor subunit alpha-4/beta-2
Type:n/a
Mol. Mass.:n/a
Description:n/a
Components:This complex has 0 components.
Component 1
Name:Neuronal acetylcholine receptor subunit alpha-4
Synonyms:ACHA4_RAT Cholinergic, Nicotinic Alpha4Beta2 Chrna4 Neuronal acetylcholine receptor (alpha4beta2 nAChR) Neuronal acetylcholine receptor subunit alpha 4 beta 2 | Neuronal acetylcholine receptor subunit alpha-4
Type:Enzyme
Mol. Mass.:70196.44
Organism:Rattus norvegicus (Rat)
Description:P09483
Residue:630
Component 2
Name:Neuronal acetylcholine receptor subunit beta-2
Synonyms:ACHB2_RAT Chrnb2 Neuronal acetylcholine receptor non-alpha-1 chain
Type:Enzyme
Mol. Mass.:56910.32
Organism:Rattus norvegicus (Rat)
Description:P12390
Residue:500
BDBM50097597
NameBDBM50097597
Synonyms:3-(3-Chloro-4-fluoro-phenyl)-5-((S)-1-methyl-pyrrolidin-2-ylmethoxy)-pyridine | CHEMBL156452
TypeSmall organic molecule
Emp. Form.C17H18ClFN2O
Mol. Mass.320.789
SMILESCN1CCC[C@H]1COc1cncc(c1)-c1ccc(F)c(Cl)c1