Reaction Details
TargetProthrombin
LigandBDBM50097621
Substrate/Competitorn/a
Meas. Tech.ChEBML_208311
Ki 800±n/a nM
Citation Fevig, JMPinto, DJHan, QQuan, MLPruitt, JRJacobson, ICGalemmo, RAWang, SOrwat, MJBostrom, LLKnabb, RMWong, PCLam PYS, naWexler, RR Synthesis and SAR of benzamidine factor Xa inhibitors containing a vicinally-substituted heterocyclic core. Bioorg Med Chem Lett11:641-5 (2001) Prothrombin
Name:Prothrombin
Type:Protein
Mol. Mass.:70029.57
Organism:Homo sapiens (Human)
Description:P00734
Residue:622
BDBM50097621
NameBDBM50097621
Synonyms:1-(3-Carbamimidoyl-phenyl)-1H-imidazole-2-carboxylic acid (2'-sulfamoyl-biphenyl-4-yl)-amide; TFA | CHEMBL349323
TypeSmall organic molecule
Emp. Form.C23H20N6O3S
Mol. Mass.460.508
SMILESNC(=N)c1cccc(c1)-n1ccnc1C(=O)Nc1ccc(cc1)-c1ccccc1S(N)(=O)=O