Reaction Details
TargetCoagulation factor X
LigandBDBM50097628
Substrate/Competitorn/a
Meas. Tech.ChEBML_48951
Ki 2.5±n/a nM
Citation Fevig, JMPinto, DJHan, QQuan, MLPruitt, JRJacobson, ICGalemmo, RAWang, SOrwat, MJBostrom, LLKnabb, RMWong, PCLam PYS, naWexler, RR Synthesis and SAR of benzamidine factor Xa inhibitors containing a vicinally-substituted heterocyclic core. Bioorg Med Chem Lett11:641-5 (2001) Coagulation factor X
Name:Coagulation factor X
Type:Enzyme
Mol. Mass.:54726.60
Organism:Homo sapiens (Human)
Description:n/a
Residue:488
BDBM50097628
NameBDBM50097628
Synonyms:5-(3-Carbamimidoyl-phenyl)-oxazole-4-carboxylic acid (2'-sulfamoyl-biphenyl-4-yl)-amide; TFA | CHEMBL157299
TypeSmall organic molecule
Emp. Form.C23H19N5O4S
Mol. Mass.461.493
SMILESNC(=N)c1cccc(c1)-c1ocnc1C(=O)Nc1ccc(cc1)-c1ccccc1S(N)(=O)=O