Reaction Details
TargetCoagulation factor X
LigandBDBM12751
Substrate/Competitorn/a
Meas. Tech.ChEMBL_48951 (CHEMBL661664)
Ki 0.030000±n/a nM
Citation Fevig, JMPinto, DJHan, QQuan, MLPruitt, JRJacobson, ICGalemmo, RAWang, SOrwat, MJBostrom, LLKnabb, RMWong, PCLam PYS, naWexler, RR Synthesis and SAR of benzamidine factor Xa inhibitors containing a vicinally-substituted heterocyclic core. Bioorg Med Chem Lett11:641-5 (2001) Coagulation factor X
Name:Coagulation factor X
Type:PROTEIN
Mol. Mass.:53951.21
Organism:Oryctolagus cuniculus
Description:ChEMBL_1471174
Residue:490
BDBM12751
NameBDBM12751
Synonyms:1-(3-carbamimidoylphenyl)-3-methyl-N-[4-(2-sulfamoylphenyl)phenyl]-1H-pyrazole-5-carboxamide CHEMBL37251 | SN-429
TypeSmall organic molecule
Emp. Form.C24H22N6O3S
Mol. Mass.474.535
SMILESCc1cc(C(=O)Nc2ccc(cc2)-c2ccccc2S(N)(=O)=O)n(n1)-c1cccc(c1)C(N)=N