Reaction Details
TargetProthrombin
LigandBDBM50097619
Substrate/Competitorn/a
Meas. Tech.ChEBML_208311
Ki 600±n/a nM
Citation Fevig, JMPinto, DJHan, QQuan, MLPruitt, JRJacobson, ICGalemmo, RAWang, SOrwat, MJBostrom, LLKnabb, RMWong, PCLam PYS, naWexler, RR Synthesis and SAR of benzamidine factor Xa inhibitors containing a vicinally-substituted heterocyclic core. Bioorg Med Chem Lett11:641-5 (2001) Prothrombin
Name:Prothrombin
Type:Protein
Mol. Mass.:70029.57
Organism:Homo sapiens (Human)
Description:P00734
Residue:622
BDBM50097619
NameBDBM50097619
Synonyms:1-(3-Carbamimidoyl-phenyl)-4-methyl-1H-imidazole-2-carboxylic acid (2'-sulfamoyl-biphenyl-4-yl)-amide; TFA | CHEMBL346825
TypeSmall organic molecule
Emp. Form.C24H22N6O3S
Mol. Mass.474.535
SMILESCc1cn(c(n1)C(=O)Nc1ccc(cc1)-c1ccccc1S(N)(=O)=O)-c1cccc(c1)C(N)=N