Reaction Details
Target5-hydroxytryptamine receptor 2C
LigandBDBM35920
Substrate/Competitorn/a
Meas. Tech.ChEBML_2780
Ki 43±n/a nM
Citation Runyon, SPSavage, JETaroua, MRoth, BLGlennon, RAWestkaemper, RB Influence of chain length and N-alkylation on the selective serotonin receptor ligand 9-(aminomethyl)-9,10-dihydroanthracene. Bioorg Med Chem Lett11:655-8 (2001) 5-hydroxytryptamine receptor 2C
Name:5-hydroxytryptamine receptor 2C
Type:Enzyme
Mol. Mass.:51948.16
Organism:Mus musculus (Mouse)
Description:P34968
Residue:459
BDBM35920
NameBDBM35920
Synonyms:9,10-dihydroanthracene(DHA), 1a 9-aminomethyl-9,10-dihydroanthracene CHEMBL47482
TypeSmall organic molecule
Emp. Form.C15H15N
Mol. Mass.209.2863
SMILESNCC1c2ccccc2Cc2ccccc12