Reaction Details
TargetTyrosine--tRNA ligase, cytoplasmic
LigandBDBM50091497
Substrate/Competitorn/a
Meas. Tech.ChEBML_226002
IC50 1.2±n/a nM
Citation Brown, PEggleston, DSHaltiwanger, RCJarvest, RLMensah, LO'Hanlon, PJPope, AJ Synthetic analogues of SB-219383. Novel C-glycosyl peptides as inhibitors of tyrosyl tRNA synthetase. Bioorg Med Chem Lett11:711-4 (2001) Tyrosine--tRNA ligase, cytoplasmic
Name:Tyrosine--tRNA ligase, cytoplasmic
Type:PROTEIN
Mol. Mass.:59145.78
Organism:Homo sapiens (Human)
Description:ChEMBL_211030
Residue:528
BDBM50091497
NameBDBM50091497
Synonyms:(S)-[(S)-2-Amino-3-(4-hydroxy-phenyl)-propionylamino]-((2S,3S,4S,5S)-1,3,4,5-tetrahydroxy-piperidin-2-yl)-acetic acid [2-Amino-3-((S)-4-hydroxy-phenyl)-propionylamino]-((2S,3S,4S,5S)-1,3,4,5-tetrahydroxy-piperidin-2-yl)-acetic acid
TypeSmall organic molecule
Emp. Form.C16H23N3O8
Mol. Mass.385.3691
SMILESN[C@@H](Cc1ccc(O)cc1)C(=O)N[C@@H]([C@H]1[C@H](O)[C@@H](O)[C@@H](O)CN1O)C(O)=O