Reaction Details
TargetTyrosine--tRNA ligase, cytoplasmic
LigandBDBM18132
Substrate/Competitorn/a
Meas. Tech.ChEBML_211024
IC50 4±n/a nM
Citation Jarvest, RLBerge, JMBrown, PHamprecht, DWMcNair, DJMensah, LO'Hanlon, PJPope, AJ Potent synthetic inhibitors of tyrosyl tRNA synthetase derived from C-pyranosyl analogues of SB-219383. Bioorg Med Chem Lett11:715-8 (2001) Tyrosine--tRNA ligase, cytoplasmic
Name:Tyrosine--tRNA ligase, cytoplasmic
Type:PROTEIN
Mol. Mass.:59145.78
Organism:Homo sapiens (Human)
Description:ChEMBL_211030
Residue:528
BDBM18132
NameBDBM18132
Synonyms:(2S)-2-[(2S)-2-amino-3-(4-hydroxyphenyl)propanamido]-2-[(2S,3R,4S,5R,6R)-3,4,5-trihydroxy-6-methyloxan-2-yl]acetic acid SB-284485
TypeSmall organic molecule
Emp. Form.C17H24N2O8
Mol. Mass.384.3811
SMILES[H][C@]1(O[C@H](C)[C@H](O)[C@H](O)[C@H]1O)[C@H](NC(=O)[C@@H](N)Cc1ccc(O)cc1)C(O)=O