Reaction Details
TargetTyrosine--tRNA ligase, cytoplasmic
LigandBDBM50097749
Substrate/Competitorn/a
Meas. Tech.ChEBML_211024
IC50 0.800000±n/a nM
Citation Jarvest, RLBerge, JMBrown, PHamprecht, DWMcNair, DJMensah, LO'Hanlon, PJPope, AJ Potent synthetic inhibitors of tyrosyl tRNA synthetase derived from C-pyranosyl analogues of SB-219383. Bioorg Med Chem Lett11:715-8 (2001) Tyrosine--tRNA ligase, cytoplasmic
Name:Tyrosine--tRNA ligase, cytoplasmic
Type:PROTEIN
Mol. Mass.:59145.78
Organism:Homo sapiens (Human)
Description:ChEMBL_211030
Residue:528
BDBM50097749
NameBDBM50097749
Synonyms:CHEMBL163375 | [2-Amino-3-((S)-4-hydroxy-phenyl)-propionylamino]-((2S,3R,4S,5R,6R)-3,4,5-trihydroxy-6-methyl-tetrahydro-pyran-2-yl)-acetic acid (S)-butyl ester
TypeSmall organic molecule
Emp. Form.C21H32N2O8
Mol. Mass.440.4874
SMILESCCCCOC(=O)[C@@H](NC(=O)[C@@H](N)Cc1ccc(O)cc1)[C@@H]1O[C@H](C)[C@H](O)[C@H](O)[C@H]1O