Reaction Details
TargetProtein kinase C theta type
LigandBDBM50097750
Substrate/Competitorn/a
Meas. Tech.ChEBML_161450
Ki 0.730000±n/a nM
Citation Tanaka, MIrie, KNakagawa, YNakamura, YOhigashi, HWender, PA The C4 hydroxyl group of phorbol esters is not necessary for protein kinase C binding. Bioorg Med Chem Lett11:719-22 (2001) Protein kinase C theta type
Name:Protein kinase C theta type
Type:Serine/threonine-protein kinase
Mol. Mass.:81878.04
Organism:Homo sapiens (Human)
Description:Full-length human PKC theta (Panvera Catalog No. P2996).
Residue:706
BDBM50097750
NameBDBM50097750
Synonyms:Butyric acid (1aR,1bS,4aS,7aR,7bR,8R,9R,9aS)-9-butyryloxy-7b-hydroxy-3-hydroxymethyl-1,1,6,8-tetramethyl-5-oxo-1,1a,1b,4,4a,5,7a,7b,8,9-decahydro-cyclopropa[3,4]benzo[1,2-e]azulen-9a-yl ester | CHEMBL265998
TypeSmall organic molecule
Emp. Form.C28H40O7
Mol. Mass.488.613
SMILESCCCC(=O)O[C@@H]1[C@@H](C)[C@]2(O)[C@@H]3C=C(C)C(=O)[C@H]3CC(CO)=C[C@H]2[C@@H]2C(C)(C)[C@]12OC(=O)CCC