Reaction Details
TargetProtein kinase C gamma type
LigandBDBM50097751
Substrate/Competitorn/a
Meas. Tech.ChEMBL_161297 (CHEMBL772105)
Ki 6321±n/a nM
Citation Nakagawa, YIrie, KNakamura, YOhigashi, H The amide hydrogen of (-)-indolactam-V and benzolactam-V8's plays a critical role in protein kinase C binding and tumor-promoting activities. Bioorg Med Chem Lett11:723-8 (2001) Protein kinase C gamma type
Name:Protein kinase C gamma type
Type:Enzyme
Mol. Mass.:78458.05
Organism:Homo sapiens (Human)
Description:The recombinant human PKC enzymes were produced using a baculovirus expression system in SF9 cells
Residue:697
BDBM50097751
NameBDBM50097751
Synonyms:(2S,5S)-8-Decyl-5-hydroxymethyl-2-isopropyl-1-methyl-1,2,5,6-tetrahydro-benzo[e][1,4]oxazocin-3-one CHEMBL318971
TypeSmall organic molecule
Emp. Form.C25H41NO3
Mol. Mass.403.5979
SMILESCCCCCCCCCCc1ccc2N(C)[C@@H](C(C)C)C(=O)O[C@H](CO)Cc2c1