Reaction Details
TargetSerine protease 1
LigandBDBM50097762
Substrate/Competitorn/a
Meas. Tech.ChEBML_212728
Ki 2100±n/a nM
Citation Jones, SDLiebeschuetz, JWMorgan, PJMurray, CWRimmer, ADRoscoe, JMWaszkowycz, BWelsh, PMWylie, WAYoung, SCMartin, HMahler, JBrady, LWilkinson, K The design of phenylglycine containing benzamidine carboxamides as potent and selective inhibitors of factor Xa. Bioorg Med Chem Lett11:733-6 (2001) Serine protease 1
Name:Serine protease 1
Type:Enzyme
Mol. Mass.:26557.80
Organism:Homo sapiens (Human)
Description:P07477
Residue:247
BDBM50097762
NameBDBM50097762
Synonyms:CHEMBL162596 | N-{[(4-Aminomethyl-cyclohexylmethyl)-carbamoyl]-naphthalen-1-yl-methyl}-3-carbamimidoyl-benzamide
TypeSmall organic molecule
Emp. Form.C28H33N5O2
Mol. Mass.471.5939
SMILESNCC1CCC(CNC(=O)C(NC(=O)c2cccc(c2)C(N)=N)c2cccc3ccccc23)CC1