Reaction Details
TargetCoagulation factor X
LigandBDBM50097768
Substrate/Competitorn/a
Meas. Tech.ChEBML_69661
Ki 120±n/a nM
Citation Jones, SDLiebeschuetz, JWMorgan, PJMurray, CWRimmer, ADRoscoe, JMWaszkowycz, BWelsh, PMWylie, WAYoung, SCMartin, HMahler, JBrady, LWilkinson, K The design of phenylglycine containing benzamidine carboxamides as potent and selective inhibitors of factor Xa. Bioorg Med Chem Lett11:733-6 (2001) Coagulation factor X
Name:Coagulation factor X
Type:Enzyme
Mol. Mass.:54726.60
Organism:Homo sapiens (Human)
Description:n/a
Residue:488
BDBM50097768
NameBDBM50097768
Synonyms:CHEMBL163112 | N-[(R)-2-(4-Benzyl-piperazin-1-yl)-2-oxo-1-phenyl-ethyl]-3-carbamimidoyl-benzamide
TypeSmall organic molecule
Emp. Form.C27H29N5O2
Mol. Mass.455.5515
SMILESNC(=N)c1cccc(c1)C(=O)N[C@@H](C(=O)N1CCN(Cc2ccccc2)CC1)c1ccccc1