Reaction Details
TargetProthrombin
LigandBDBM50097754
Substrate/Competitorn/a
Meas. Tech.ChEBML_208308
Ki 1180±n/a nM
Citation Jones, SDLiebeschuetz, JWMorgan, PJMurray, CWRimmer, ADRoscoe, JMWaszkowycz, BWelsh, PMWylie, WAYoung, SCMartin, HMahler, JBrady, LWilkinson, K The design of phenylglycine containing benzamidine carboxamides as potent and selective inhibitors of factor Xa. Bioorg Med Chem Lett11:733-6 (2001) Prothrombin
Name:Prothrombin
Type:Protein
Mol. Mass.:70029.57
Organism:Homo sapiens (Human)
Description:P00734
Residue:622
BDBM50097754
NameBDBM50097754
Synonyms:3-Carbamimidoyl-N-{(R)-2-[4-(4-fluoro-benzoyl)-piperidin-1-yl]-2-oxo-1-phenyl-ethyl}-benzamide | CHEMBL162634
TypeSmall organic molecule
Emp. Form.C28H27FN4O3
Mol. Mass.486.5374
SMILESNC(=N)c1cccc(c1)C(=O)N[C@@H](C(=O)N1CCC(CC1)C(=O)c1ccc(F)cc1)c1ccccc1