Reaction Details
TargetCoagulation factor X
LigandBDBM50097752
Substrate/Competitorn/a
Meas. Tech.ChEBML_69661
Ki 500±n/a nM
Citation Jones, SDLiebeschuetz, JWMorgan, PJMurray, CWRimmer, ADRoscoe, JMWaszkowycz, BWelsh, PMWylie, WAYoung, SCMartin, HMahler, JBrady, LWilkinson, K The design of phenylglycine containing benzamidine carboxamides as potent and selective inhibitors of factor Xa. Bioorg Med Chem Lett11:733-6 (2001) Coagulation factor X
Name:Coagulation factor X
Type:Enzyme
Mol. Mass.:54726.60
Organism:Homo sapiens (Human)
Description:n/a
Residue:488
BDBM50097752
NameBDBM50097752
Synonyms:CHEMBL348963 | N-[(R)-(4-Aminomethyl-benzylcarbamoyl)-phenyl-methyl]-3-carbamimidoyl-benzamide
TypeSmall organic molecule
Emp. Form.C24H25N5O2
Mol. Mass.415.4876
SMILESNCc1ccc(CNC(=O)[C@H](NC(=O)c2cccc(c2)C(N)=N)c2ccccc2)cc1