Reaction Details
TargetSerine protease 1
LigandBDBM50097775
Substrate/Competitorn/a
Meas. Tech.ChEBML_212728
Ki 650±n/a nM
Citation Jones, SDLiebeschuetz, JWMorgan, PJMurray, CWRimmer, ADRoscoe, JMWaszkowycz, BWelsh, PMWylie, WAYoung, SCMartin, HMahler, JBrady, LWilkinson, K The design of phenylglycine containing benzamidine carboxamides as potent and selective inhibitors of factor Xa. Bioorg Med Chem Lett11:733-6 (2001) Serine protease 1
Name:Serine protease 1
Type:Enzyme
Mol. Mass.:26557.80
Organism:Homo sapiens (Human)
Description:P07477
Residue:247
BDBM50097775
NameBDBM50097775
Synonyms:CHEMBL163578 | N-[(R)-2-(4-Benzyl-piperidin-1-yl)-2-oxo-1-phenyl-ethyl]-3-carbamimidoyl-benzamide
TypeSmall organic molecule
Emp. Form.C28H30N4O2
Mol. Mass.454.5634
SMILESNC(=N)c1cccc(c1)C(=O)N[C@@H](C(=O)N1CCC(Cc2ccccc2)CC1)c1ccccc1