Reaction Details
TargetProthrombin
LigandBDBM50097759
Substrate/Competitorn/a
Meas. Tech.ChEBML_208308
Ki 1740±n/a nM
Citation Jones, SDLiebeschuetz, JWMorgan, PJMurray, CWRimmer, ADRoscoe, JMWaszkowycz, BWelsh, PMWylie, WAYoung, SCMartin, HMahler, JBrady, LWilkinson, K The design of phenylglycine containing benzamidine carboxamides as potent and selective inhibitors of factor Xa. Bioorg Med Chem Lett11:733-6 (2001) Prothrombin
Name:Prothrombin
Type:Protein
Mol. Mass.:70029.57
Organism:Homo sapiens (Human)
Description:P00734
Residue:622
BDBM50097759
NameBDBM50097759
Synonyms:3-Carbamimidoyl-N-[(R)-2-oxo-1-phenyl-2-(4-phenyl-piperazin-1-yl)-ethyl]-benzamide | CHEMBL435865
TypeSmall organic molecule
Emp. Form.C26H27N5O2
Mol. Mass.441.5249
SMILESNC(=N)c1cccc(c1)C(=O)N[C@@H](C(=O)N1CCN(CC1)c1ccccc1)c1ccccc1